Download SB012 - Cincinnati Test Systems

Transcript
Service Bulletin: #012
Page 2
Table Evaluation (continued)
LP
LU
MF
MS
NE
OC
OE
PA
PB
PC
PE
PF
PH
PL
PP
PR
PS
PV
PX
QC
R
R1
R2
R3
RF
RH
RL
RX
S1
S2
S3
S4
SB
SC
SE
SF
ERROR: LINK PROG IS PARENT
ERROR: LINK PROG UNDEFINED
ERROR: PART MARK FAULT
MAN FILL SWITCH
NO EVENT OCCURRED
ATMOSPHERIC PRESSURE COMPLETE
ATMOSPHERIC PRESSURE ERROR
ABOVE TARGET PRESSURE
BELOW TARGET PRESSURE
ERROR: PART NOT CHANGED
PROGRAM CONFIGURATION ERROR
PART NOT FULL
TEST PRESSURE HIGH
TEST PRESSURE LOW
ERROR: PART NOT PRESENT
POWER RESET
PART NOT STABILIZED
PROCESS FAULT
PART NOT EXHAUSTED
SEQUENCE COMPLETE
PROGRAM REJECT
PART REJECT - LEVEL 1
PART REJECT - LEVEL 2
PART REJECT - LEVEL 3
CHAMBER RISE FAULT
PRE-PRESSURE HIGH
PRE-PRESSURE LOW
SOURCE PRESSURE EXCEEDED
LD ZERO < MIN
LD ZERO > MAX
LD LEAK < MIN
LD LEAK > MAX
STOP BUTTON PRESSED
START COMMON INPUT LOW
PRESSURE SELECT CONFIG ERROR
SELF-TEST FAILED
SH
SI
SL
SM
SN
SP
SR
ST
SU
SX
TB
TC
TE
TI
TM
TP
TR
TS
TX
VR
WA
WB
WC
WH
WL
WR
WS
XC
XE
XF
XH
XL
XO
XP
XV
XZ
ERROR: STOP INPUT HIGH
STOP INPUT RECEIVED
SEVERE LEAK
SNIFFER MODE MISMATCH
ERROR: SNIFFER NOT READY
SELF-TEST PASSED
SNIFFER READY INPUT FAULT
SNIFFER TYPE MISMATCH
SNIFFER UNITS MISMATCH
SYSTEM PRESSURE EXCEEDED
T-GAS BACKGROUND FAULT
T-GAS CHAMBER CLEANUP FAULT
ERROR: TOOLING NOT RESET
ERROR: TWO-INPUT REQ TO START
T-GAS MIN LEAK RATE FAULT
TEST PORT SELECT CONFIG ERROR
ERROR: TOOLING NOT RETRACTED
TOOLING RESET
ERROR: TOOLING NOT EXTENDED
VENT PART RESET TOOLING
WEIGHT ABOVE MAX
WEIGHT BELOW MIN
SCALE CONFIG ERROR
SCALE WEIGHT HIGH
SCALE WEIGHT LOW
SCALE NOT READY
SCALE NOT STABLE
TRANSDUCER CAL COMPLETE
TRANSDUCER CAL ERROR
PRESSURE TRANSDUCER FAULT
EXT SWITCH DID NOT GO HIGH
EXT SWITCH DID NOT GO LOW
TRANSDUCER OVER-RANGE
EXTERNAL XDCR PRESS
TRANSDUCER VERIFY COMPLETE
TRANSDUCER ZERO BAD
Table Results
P
F
E
S
X
Y
TEST PASSED
TEST FAILED
TEST ERROR
TEST SKIPPED
TEST FAILED - LEVEL 1
TEST FAILED - LEVEL 2
Y
Z
M
L
N
C
TEST FAILED - LEVEL 2
TEST FAILED - LEVEL 3
AUTO-CAL MASTER PART
AUTO-CAL LEAK STANDARD PART
TEST FAILED - NO EVENT
TEST COMPLETE